key people in health services research
type: Concept
narrower: David L. Sackett

David L. Sackett
definition: David L. Sackett is widely regarded as one of the originators of evidence-based medicine (EBM), which is the integration of the best research evidence and clinical expertise in the care of individual patients. Evidence-based medicine has revolutionized the thinking of many clinical practitioners. [Source: Encyclopedia of Health Services Research; Sackett, David L.]
broader: key people in health services research
type: Concept

people
type: Collection
type: ConceptGroup
member: David L. Sackett