Declaration of Helsinki
definition: The Declaration of Helsinki is a formal statement of ethical principles published by the World Medical Association (WMA) to guide the protection of human participants in medical research. The Declaration is not a legally binding document but has served as a foundation for national and regional laws governing medical research across the world. [Source: Encyclopedia of Research Design; Declaration of Helsinki]
broader: ethics / research ethics
type: Concept

methods
type: Collection
type: ConceptGroup
member: Declaration of Helsinki

ethics / research ethics
type: Concept
narrower: Declaration of Helsinki