Diego Rivera
definition: Recognized for murals that link aesthetic form with politics, Diego Rivera is widely considered Mexico's greatest muralist. He is prominent among the artists involved in the Mexican muralist movement, which defined muralism as the confluence of art and politics in postrevolution Mexico. [Source: Encyclopedia of Activism and Social Justice; Rivera, Diego (1886–1957)]
broader: plastic arts
type: Concept

plastic arts
type: Concept
narrower: Diego Rivera

people
type: Collection
type: ConceptGroup
member: Diego Rivera