institutions studying climate change
type: Concept
narrower: Edison Electric Institute

Edison Electric Institute
definition: THE EDISON ELECTRIC Institute (EEI) is an association or a trade group representative that seeks to represent people and organizations owning stock in power companies. The stock companies represented by the EEI directly represent 95 percent of the power consumers served by stock companies generating electric power in the United States, which produce about 70 percent of the total power produced in the United States. [Source: Encyclopedia of Global Warming and Climate Change; Edison Electric Institute]
broader: institutions studying climate change
type: Concept

organizations
type: Collection
type: ConceptGroup
member: Edison Electric Institute