Findhorn Foundation Community
definition: The Findhorn community is an international center in northeast Scotland where people live and work together creating new models of ecology, economics, culture, and spirituality. Love and respect for the divinity in all life has given rise to the development of an ecovillage that nurtures holistic education and a rich community life that inspires individuals and other communities. [Source: Encyclopedia of Community: From the Village to the Virtual World; Findhorn Foundation Community]
broader: communities: case studies
type: Concept

organizations
type: Collection
type: ConceptGroup
member: Findhorn Foundation Community

communities: case studies
type: Concept
narrower: Findhorn Foundation Community