cases
type: Collection
type: ConceptGroup
member: Flores v. State of Arizona

Flores v. State of Arizona
definition: In Arizona, approximately 15% of students attending public school are English language learners (ELLs), according to the Office of English Language Acquisition. Beginning in 2006, all high school students must pass an achievement test to graduate from high school. [Source: Encyclopedia of Bilingual Education; Flores v. State of Arizona]
broader: policy evolution
type: Concept

policy evolution
type: Concept
narrower: Flores v. State of Arizona