institutions studying climate change
type: Concept
narrower: Florida State University

organizations
type: Collection
type: ConceptGroup
member: Florida State University

Florida State University
definition: LOCATED IN TALLAHASSEE, in the southern part of the state, Florida State University (FSU) has been involved in global warming and climate change research since the early 1960s. In conjunction with the geological sciences division of FSU, the Office of Polar Programs of the National Science Foundation established the Antarctic Marine Geology Research Facility (AMGRF) to serve as a curatorial and research center. [Source: Encyclopedia of Global Warming and Climate Change; Florida State University]
broader: institutions studying climate change
type: Concept