Framingham MCI
definition: Massachusetts Correctional Institution–Framingham (MCI–Framingham), located 22 miles west of Boston in Framingham, Massachusetts, is the oldest women's prison in the United States. All women sentenced to serve state time are processed at Framingham before being assigned to wherever they will serve out their sentence. [Source: Encyclopedia of Prisons & Correctional Facilities; Framingham, MCI (Massachusetts Correctional Institution)]
broader: institutions
type: Concept

institutions
type: Concept
narrower: Framingham MCI

organizations
type: Collection
type: ConceptGroup
member: Framingham MCI