Ganges
alternative label: River Ganga
definition: The river Ganga, known in the Western world as the Ganges, is one of the most important rivers in India. The history, geography, ecology, food production, and economic fortunes of India have all been closely connected to the river, and millions of Hindus hold it to be sacred. [Source: Encyclopedia of Global Religion; Ganga]
broader: concepts in global religion
type: Concept

concepts
type: Collection
type: ConceptGroup
member: Ganges

concepts in global religion
type: Concept
narrower: Ganges