Gulf of Tonkin Resolution
definition: 1964 The Gulf of Tonkin Resolution, promulgated in August 1964, marked one of the most critical turning points in the long history of American involvement in the Vietnam War. Under the resolution, the U.S. Congress granted Pres. [Source: Encyclopedia of U.S. Political History; Gulf of Tonkin Resolution]
end: 1964
start: 1964
date: 1964
broader: powers of Congress
type: Concept

powers of Congress
type: Concept
narrower: Gulf of Tonkin Resolution

concepts
type: Collection
type: ConceptGroup
member: Gulf of Tonkin Resolution