racial, ethnic, and nationality groups
type: Concept
narrower: Haitian Americans

Haitian Americans
definition: Haitian Americans are an emergent group among recent immigrants to the United States. Haitians are the second-largest black immigrant group, after Jamaicans, with strong transnational connection to their homeland. [Source: Multicultural America: A Multimedia Encyclopedia; Haitian Americans]
broader: racial, ethnic, and nationality groups
type: Concept

concepts
type: Collection
type: ConceptGroup
member: Haitian Americans