theories, models, and philosophical perspectives
type: Concept
narrower: Hampton model

Hampton model
definition: Founded in 1868 by Samuel Chapman Armstrong, Hampton Institute established the model for education among Southern Blacks. Born in Hawai'i to American missionaries, Armstrong grew up in a family immersed in the islands' religious, social, and educational life. [Source: Encyclopedia of the Social and Cultural Foundations of Education; Hampton Model]
broader: theories, models, and philosophical perspectives
type: Concept

concepts
type: Collection
type: ConceptGroup
member: Hampton model