Hang Seng Index
definition: The Hang Seng Index (HSI) is the internationally recognized stock market indicator of the Stock Exchange of Hong Kong (SEHK). The HSI is a free-float capitalization-weighted index of selected companies listed on the Hong Kong exchange. [Source: Encyclopedia of Business in Today's World; Hang Seng Index]
broader: international finance
type: Concept

international finance
type: Concept
narrower: Hang Seng Index

concepts
type: Collection
type: ConceptGroup
member: Hang Seng Index