organizations
type: Collection
type: ConceptGroup
member: Indiana Academy

Indiana Academy
definition: The Indiana Academy for Science, Mathematics, and Humanities (Indiana Academy) was created in 1988 by the Indiana State Legislature to become the state's public residential school for intellectually gifted high school juniors and seniors. It was created to attend to increasing concerns about the future of the state by offering a special educational opportunity to some of Indiana's most able minds. [Source: Encyclopedia of Giftedness, Creativity, and Talent; Indiana Academy]
broader: specialized secondary schools
type: Concept

specialized secondary schools
type: Concept
narrower: Indiana Academy