organizations and associations
type: Concept
narrower: International Clinical Epidemiology Network

organizations
type: Collection
type: ConceptGroup
member: International Clinical Epidemiology Network

International Clinical Epidemiology Network
definition: An international initiative to develop public health workforces – trained in interdisciplinary contexts – in underdeveloped countries, and to provide scientific and financial support (White, K. L. [Source: The Sage Dictionary of Health and Society; International Clinical Epidemiology Network (INCLEN)]
broader: organizations and associations
type: Concept