International Handbook of Curriculum Research
definition: The International Handbook of Curriculum Research, a collection of essays edited by William F. Pinar, contributed to expanding international perspectives in the areas of curriculum studies and research. The text's publication in 2003 followed the establishment in 2001 of the International Association for the Advancement of Curriculum Studies (IAACS). [Source: Encyclopedia of Curriculum Studies; International Handbook of Curriculum Research]
broader: publications
type: Concept

publications
type: Concept
narrower: International Handbook of Curriculum Research

concepts
type: Collection
type: ConceptGroup
member: International Handbook of Curriculum Research