J. Craig Venter
definition: J. Craig Venter is an entrepreneurial scientist who has made international headlines for his work sequencing the human genome, discovering new microorganisms and genes in the ocean, and, more recently, engineering synthetic life. Patents on his discoveries caused international concern and speculation about intellectual property rights relating to DNA.Born in Salt Lake City, Utah, on October 14, 1946, Venter performed poorly at school and was more interesting in building things. [Source: Encyclopedia of Science and Technology Communication; Venter, J. Craig (1946–)]
broader: key people in science and technology communication
type: Concept

people
type: Collection
type: ConceptGroup
member: J. Craig Venter

key people in science and technology communication
type: Concept
narrower: J. Craig Venter