key people in law and society
type: Concept
narrower: J. Willard Hurst

J. Willard Hurst
definition: James Willard Hurst, a law professor at the University of Wisconsin, was both a leading legal historian and a key founder of the law and society movement in the United States. Hurst studied at Williams College, where he focused especially on the progressive historians Charles (1874–1948) and Mary Beard (1876–1958). [Source: Encyclopedia of Law & Society: American and Global Perspectives; Hurst, J. Willard (1910–1997)]
broader: key people in law and society
type: Concept

people
type: Collection
type: ConceptGroup
member: J. Willard Hurst