key people in political communication
type: Concept
narrower: Jacques Chirac

Jacques Chirac
definition: Born on November 29, 1932, Jacques Chirac's activity in French politics started in 1965 with a local mandate. His first job as assistant minister (secrétaire d'état) came in May 1967, and thereafter, he never stopped holding prominent political mandates or offices. [Source: Encyclopedia of Political Communication; Chirac, Jacques (1932–)]
broader: key people in political communication
type: Concept

people
type: Collection
type: ConceptGroup
member: Jacques Chirac