West Indies
type: Concept
narrower: Jamaica

concepts
type: Collection
type: ConceptGroup
member: Jamaica

Jamaica
definition: Jamaica is an island in the Caribbean Sea, with an area of 10,991 square kilometers and a population of 2.7 million (July 2003 estimate). The Jamaica Constabulary Force The Jamaica Constabulary Force traces its genesis to the Morant Bay Rebellion in 1865 when Jamaica was a colony of the British Empire. [Source: Encyclopedia of Law Enforcement; Jamaica]
broader: West Indies
type: Concept