Köppen-Geiger climate classification
definition: The Köppen-Geiger is a system of global climate classification created by Wladimir Peter Köppen and subsequently updated and revised by Köppen in collaboration with Rudolf Geiger. It is the best-known and most widely used global climate classification available. [Source: Encyclopedia of Geography; Köppen-Geiger Climate Classification]
broader: climatology
type: Concept

climatology
type: Concept
narrower: Köppen-Geiger climate classification

concepts
type: Collection
type: ConceptGroup
member: Köppen-Geiger climate classification