Katherine Boudin
definition: Katherine Boudin, a member of the Weatherman terrorist group, was involved in a bomb explosion in New York City in 1970, and she was arrested and imprisoned for life for her participation in an armed robbery that left two police officers and a security guard dead. The daughter of the attorney and civil rights activist Leonard Boudin, Katherine Boudin graduated from Bryn Mawr College in Pennsylvania. [Source: The SAGE Encyclopedia of Terrorism; Boudin, Katherine (1942–)]
broader: people associated with terrorism
type: Concept

people associated with terrorism
type: Concept
narrower: Katherine Boudin

people
type: Collection
type: ConceptGroup
member: Katherine Boudin