Kemet, Afrocentricity and Knowledge
definition: Kemet, Afrocentricity and Knowledge is the third of Molefi Kete Asante's three books explicating his theoretical ideas on Afrocentricity. Asante's first groundbreaking text, Afrocentricity: A Theory of Social Knowledge (1980), points toward a new paradigm of knowledge and social theory. [Source: Encyclopedia of Black Studies; Kemet, Afrocentricity and Knowledge]
broader: books (publishing)
type: Concept

books (publishing)
type: Concept
narrower: Kemet, Afrocentricity and Knowledge

concepts
type: Collection
type: ConceptGroup
member: Kemet, Afrocentricity and Knowledge