key people in anthropology
type: Concept
narrower: Kenneth L. Pike

people
type: Collection
type: ConceptGroup
member: Kenneth L. Pike

Kenneth L. Pike
definition: Dr. Kenneth Lee Pike was born in Woodstock, CT, in 1912. [Source: Encyclopedia of Anthropology; Pike, Kenneth L. (1912–2000)]
broader: key people in anthropology
type: Concept