key people in urban studies
type: Concept
narrower: Kenneth T. Jackson

people
type: Collection
type: ConceptGroup
member: Kenneth T. Jackson

Kenneth T. Jackson
definition: Kenneth T. Jackson, one of the most prominent U.S. urban historians, has strongly influenced the agenda of the field and also made active collaborative and institutional contributions. His work covers the broad sweep of U.S. urban history and more specific topics, especially New York City, where he is Jacques Barzun Professor of History and the Social Sciences at Columbia University. [Source: Encyclopedia of Urban Studies; Jackson, Kenneth T.]
broader: key people in urban studies
type: Concept