Laos
definition: Laos (Lao People's Democratic Republic) was part of the kingdom of Lan Xang, established under King Fa Ngum in the 14th century, which also included parts of Thailand and Cambodia. It was dominated by Thailand from the late 18th to the late 19th century, when it was colonized by France and became, along with Vietnam and Cambodia, part of French Indochina until the decisive military victory by the Viet Minh at the battle of Dien Bien Phu in 1954. [Source: Sociology of Education: An A-to-Z Guide; Laos]
broader: Southeastern Asia
type: Concept

concepts
type: Collection
type: ConceptGroup
member: Laos

Southeastern Asia
type: Concept
narrower: Laos