League of Small Democratic Schools
definition: In 2004, John Goodlad and colleagues from the Institute for Educational Inquiry (IEI), a 501(c)(3) organization founded in 1992, created the League of Small Democratic Schools (LSDS) with a grant donation from the Arthur Vining Davis Foundations. In August 2007, the League of Small Democratic Schools was renamed the League of Democratic Schools (LODS). [Source: Encyclopedia of Educational Reform and Dissent; League of Small Democratic Schools]
broader: advisory organizations
type: Concept

organizations
type: Collection
type: ConceptGroup
member: League of Small Democratic Schools

advisory organizations
type: Concept
narrower: League of Small Democratic Schools