assessment areas and techniques
type: Concept
narrower: Life Style Inventory

Life Style Inventory
definition: The Level I: Life Style Inventory (LSI) was originally developed by J. Clayton Lafferty in 1973. The Level I: LSI is described as a self-assessment of 12 different thinking and behavioral styles of interest to members of work organizations. [Source: Encyclopedia of Career Development; Life Style Inventory]
broader: assessment areas and techniques
type: Concept

concepts
type: Collection
type: ConceptGroup
member: Life Style Inventory