Ma Xiwu
definition: The judicial thought and practice of Ma Xiwu has had great influence on the importance and style of mediation in the People's Republic of China. Ma was a key figure in Communist Party attempts to combine a socialist revolution with administrative consolidation during the late 1930s and the early 1940s. [Source: Encyclopedia of Law & Society: American and Global Perspectives; Ma Xiwu (1899–1962)]
broader: key people in law and society
type: Concept

key people in law and society
type: Concept
narrower: Ma Xiwu

people
type: Collection
type: ConceptGroup
member: Ma Xiwu