cultural/social anthropology
type: Concept
narrower: Maasai

concepts
type: Collection
type: ConceptGroup
member: Maasai

Maasai
definition: The Maasai people live in East Africa. They may have separated from other Nilotic groups as early as 1,000 years ago and moved into what is known today as the countries of Sudan and Uganda. [Source: Encyclopedia of African Religion; Maasai]
broader: cultural/social anthropology
type: Concept