Malta
definition: Malta has long been considered a minority culture in the area of marriage and family life. It was the last country in Europe to introduce divorce legislation (in 2011). [Source: Cultural Sociology of Divorce: An Encyclopedia; Malta]
broader: Mediterranean islands
type: Concept

Mediterranean islands
type: Concept
narrower: Malta

concepts
type: Collection
type: ConceptGroup
member: Malta