institutions studying climate change
type: Concept
narrower: Marshall Institute

organizations
type: Collection
type: ConceptGroup
member: Marshall Institute

Marshall Institute
definition: THE GEORGE MARSHALL Institute (GMI) is a nonprofit organization founded in 1984. The mission of the Institute is to improve the use of science in making public policy about important issues for which science and technology are major considerations. [Source: Encyclopedia of Global Warming and Climate Change; Marshall Institute]
broader: institutions studying climate change
type: Concept