organizations and associations
type: Concept
narrower: MedicAlert

MedicAlert
definition: MedicAlert is a nonprofit company founded in 1956 by Dr. James Collins. [Source: Encyclopedia of Global Health; MedicAlert]
broader: organizations and associations
type: Concept

organizations
type: Collection
type: ConceptGroup
member: MedicAlert