key people in human development
type: Concept
narrower: Nancy Bayley

Nancy Bayley
definition: Nancy Bayley was born and reared in The Dalles, Oregon, and died in Carmel, California. In the history of developmental psychology, few other individuals loom so large. [Source: Encyclopedia of Human Development; Bayley, Nancy (1899–1994)]
broader: key people in human development
type: Concept

people
type: Collection
type: ConceptGroup
member: Nancy Bayley