organizations (cancer)
type: Concept
narrower: National Cancer Policy Board

National Cancer Policy Board
definition: FROM 1997 TO 2005 the National Cancer Policy Board functioned within the Institute of Medicine (IOM) of the National Academies and the National Research Council (NRC). The NRC's chairman appointed board members, and each member served a three-year term. [Source: Encyclopedia of Cancer and Society; National Cancer Policy Board]
broader: organizations (cancer)
type: Concept

organizations
type: Collection
type: ConceptGroup
member: National Cancer Policy Board