National Council on Problem Gambling
definition: The National Council on Problem Gambling (NCPG) is the national advocate for programs and services to assist problem gamblers and their families. The NCPG was founded in New York City in 1972 by Joseph Dunne, Irving Sacher, and Robert Custer. [Source: Encyclopedia of Substance Abuse Prevention, Treatment, & Recovery; National Council on Problem Gambling]
broader: problem gambling
type: Concept

organizations
type: Collection
type: ConceptGroup
member: National Council on Problem Gambling

problem gambling
type: Concept
narrower: National Council on Problem Gambling