organizations and associations
type: Concept
narrower: National Environmental Health Association

organizations
type: Collection
type: ConceptGroup
member: National Environmental Health Association

National Environmental Health Association
definition: The National Environmental Health Association (NEHA) was created in 1937 in California to establish standards for environmental health professionals. The environmental health field was still in its infancy stages and founders of the NEHA believed that these standards were needed to legitimize the profession. [Source: Encyclopedia of Global Health; National Environmental Health Association (NEHA)]
broader: organizations and associations
type: Concept