political and social movements (Latin America and Caribbean)
type: Concept
narrower: Pancho Villa

people
type: Collection
type: ConceptGroup
member: Pancho Villa

Pancho Villa
definition: Together with Emiliano Zapata, José Doroteo Arango Arámbula, better known by his nickname Pancho Villa, was one of the foremost rebel leaders of the Mexican Revolution (1910–1920). Villa is widely regarded as an outlaw, but his willingness to help the poor and oppressed has also made him a popular hero in the cultural history of modern Mexico. [Source: Encyclopedia of Activism and Social Justice; Villa, Pancho (1878–1923)]
broader: political and social movements (Latin America and Caribbean)
type: Concept