organizations
type: Collection
type: ConceptGroup
member: Pew Charitable Trusts

Pew Charitable Trusts
definition: The Pew Charitable Trusts is the single recipient of seven charitable funds initiated by the children of Joseph N. Pew, the creator of Sun Oil Company, and his wife, Mary Anderson Pew. The four founders of the Pew Charitable Trusts were Joseph N. Pew, Jr., J. Howard Pew, Mary Ethel Pew, and Mabel Pew Myrin. [Source: Encyclopedia of Health Services Research; Pew Charitable Trusts]
broader: foundations
type: Concept

foundations
type: Concept
narrower: Pew Charitable Trusts