Prix Jeunesse Foundation
definition: PRIX JEUNESSE is the premier international children's television organization. Through its biannual competition, its networking and coordination efforts, and its outreach programs, the foundation strives to promote quality children's programming around the world. [Source: Encyclopedia of Children, Adolescents, and the Media; Prix Jeunesse Foundation]
broader: advocacy groups
type: Concept

advocacy groups
type: Concept
narrower: Prix Jeunesse Foundation

organizations
type: Collection
type: ConceptGroup
member: Prix Jeunesse Foundation