public housing
type: Concept
narrower: Pruitt-Igoe

concepts
type: Collection
type: ConceptGroup
member: Pruitt-Igoe

Pruitt-Igoe
definition: The Pruitt-Igoe public housing development in St. Louis, Missouri, is among the most notorious public housing projects ever built in the United States. [Source: The Encyclopedia of Housing; Pruitt-Igoe]
broader: public housing
type: Concept