West Indies
type: Concept
narrower: Puerto Rico

Puerto Rico
definition: Puerto Rico is a commonwealth politically allied with the United States since 1898, and Puerto Ricans have been U.S. citizens since 1917 but do not vote for the U.S. [Source: Encyclopedia of Women in Today's World The Multimedia Encyclopedia of Women in Today's World; Puerto Rico]
broader: West Indies
type: Concept

concepts
type: Collection
type: ConceptGroup
member: Puerto Rico