Middle East
type: Concept
narrower: Qatar

Qatar
definition: Qatar is an Arab emirate in the Middle East, bordered by Saudi Arabia and the Persian Gulf. It is a monarchy governed by an emir who exercises power with few restraints. [Source: Encyclopedia of Motherhood; Qatar]
broader: Middle East
type: Concept

concepts
type: Collection
type: ConceptGroup
member: Qatar