cultural/social anthropology
type: Concept
narrower: Qing Dynasty

concepts
type: Collection
type: ConceptGroup
member: Qing Dynasty

Qing Dynasty
definition: The Jurchens (“Nuzhen” in Chinese pinyin romanization) were a Tungusic people who inhabited parts of northeast China and North Korea. Around the 11th century, part of the Jurchens migrated to the Yellow River basin. [Source: Encyclopedia of Anthropology; Qing, the Last Dynasty of China]
broader: cultural/social anthropology
type: Concept