gifted and talented programs and interventions
type: Concept
narrower: Roeper Review

Roeper Review
definition: The Roeper Review is one of the leading scholarly journals serving gifted education and related fields. George and Annemarie Roeper, holocaust survivors and founders of the innovative Roeper School in Bloomfield Hills, Michigan, founded the journal in 1978. [Source: Encyclopedia of Giftedness, Creativity, and Talent; Roeper Review]
broader: gifted and talented programs and interventions
type: Concept

concepts
type: Collection
type: ConceptGroup
member: Roeper Review