assessment areas and techniques
type: Concept
narrower: Rokeach Values Survey

concepts
type: Collection
type: ConceptGroup
member: Rokeach Values Survey

Rokeach Values Survey
definition: The Rokeach Values Survey (RVS) was originally developed in 1973 by Milton Rokeach. The RVS is one of the most extensively used measures of human values and is utilized by career counselors to assess clients' values as they relate to the world of work. [Source: Encyclopedia of Career Development; Rokeach Values Survey]
broader: assessment areas and techniques
type: Concept