Eastern Europe
type: Concept
narrower: Romania

Romania
definition: Romania is located in southeastern Europe and is bordered by Bulgaria, the Ukraine, and the Black Sea. It has a population of about 22 million people. [Source: Sociology of Education: An A-to-Z Guide; Romania]
broader: Eastern Europe
type: Concept

concepts
type: Collection
type: ConceptGroup
member: Romania