Solar Energy Industries Association
definition: THE SOLAR ENERGY Industry Association (SEIA) is an American trade association for the solar industry, working to expand markets, strengthen and develop research, and improve education for the employment of solar energy. SEIA is affiliated with the PVNow coalition of photovoltaic companies, which aims to expand the North American-distributed, grid-connected photovoltaic market opportunities and eliminate market barriers. [Source: Encyclopedia of Global Warming and Climate Change; Solar Energy Industries Association (SEIA)]
broader: institutions studying climate change
type: Concept

institutions studying climate change
type: Concept
narrower: Solar Energy Industries Association

organizations
type: Collection
type: ConceptGroup
member: Solar Energy Industries Association