Southeast Asian Americans
definition: Southeast Asian Americans comprise six Southeast Asian groups: Vietnamese, Cambodians, Laotians, Hmong, Chinese Vietnamese, and Mien. A majority of this population migrated to the United States during the Vietnam War. [Source: Encyclopedia of Multicultural Psychology; Southeast Asian Americans]
broader: ethnic groups
type: Concept

concepts
type: Collection
type: ConceptGroup
member: Southeast Asian Americans

ethnic groups
type: Concept
narrower: Southeast Asian Americans