Southern Education Board
definition: The southern education reform movement of the late 19th and early 20th centuries was a multifaceted effort that included a number of philanthropic funds and a lobbying arm, the Southern Education Board (SEB). The SEB's advocacy led to an increase in appropriations for education in all of the southern states between 1900 and 1930. [Source: Encyclopedia of Educational Reform and Dissent; Southern Education Board]
broader: government
type: Concept

government
type: Concept
narrower: Southern Education Board

organizations
type: Collection
type: ConceptGroup
member: Southern Education Board